{"text_format":"1","workbook":"xlsx","n_sheets":3,"sheets":["Order Form","Macro Breakdown - Meal Prep","Options List"],"not_rendered":{"charts":0,"images":2,"macros":1,"external_links":0,"defined_names":9,"comments":0,"pivot_tables":0},"unopened":[],"bounds":{"document_bytes":16777216,"sheet_cells":100000,"rows_first":2000,"rows_last":500,"rows_between":2000,"halvings":0,"cell_chars":16384,"cell_head_chars":4096},"cells_cut":0,"cells_raw":0,"read":"whole","date_system":"1900"}

{"sheet":"Order Form","index":0,"n_rows":88,"n_cols":11,"rows_kept":88,"cut":false,"hidden":false,"merged":[[57,0,57,10],[58,0,58,2],[73,0,73,10],[74,0,74,2],[10,9,10,10],[26,9,26,10],[42,9,42,10],[58,9,58,10],[74,9,74,10],[10,0,10,2],[25,0,25,10],[26,0,26,2],[41,0,41,10],[0,0,0,10],[4,1,4,2],[42,0,42,2],[9,0,9,10],[8,8,8,9]]}
["MACRO TRACKER"]
["Email Order to:","EatCleanKamloopsOrders@outlook.com",null,null,null,null,null,null,"Name"]
["Phone Order in:","778-471-0804",null,null,null,null,null,null,"Phone "]
["Drop Order off:","102-795 McGill Rd, Kamloops",null,null,null,null,null,null,"Email:"]
["Pick up Location:","102-795 McGill Rd, Kamloops",null,null,null,null,null,null,"Pick Up Date"]
[null,null,null,null,null,null,null,null,"Pick Up Time"]
[null,"CTRL+Q TO CLEAR SHEET"]
[]
[null,null,null,null,null,null,null,null,"Total Price with Taxes",null,{"$f":"(#REF!*0.05)+#REF!","v":{"$error":"#REF!"}}]
["MEAL 1"]
["Use Drop Down Menus to Choose Options",null,null,null,null,null,null,null,null,"Use Drop Down Menu to Choose Options"]
["Food Type","Food","Portion Size (g)","Price ($)","Protein (g)","Carbs (g)","Fat (g)","Calories",null,"Meal 1 Quantity (Min. 2)"]
[null,null,null,{"$f":"SUMIFS('Macro Breakdown - Meal Prep'!$K:$K,'Macro Breakdown - Meal Prep'!$B:$B,'Order Form'!$B13,'Macro Breakdown - Meal Prep'!$C:$C,'Order Form'!$C13)","v":0},{"$f":"SUMIFS('Macro Breakdown - Meal Prep'!I$5:I$152,'Macro Breakdown - Meal Prep'!$B$5:$B$152,'Order Form'!$B13,'Macro Breakdown - Meal Prep'!$C$5:$C$152,'Order Form'!$C13)","v":0},{"$f":"SUMIFS('Macro Breakdown - Meal Prep'!H$5:H$152,'Macro Breakdown - Meal Prep'!$B$5:$B$152,'Order Form'!$B13,'Macro Breakdown - Meal Prep'!$C$5:$C$152,'Order Form'!$C13)","v":0},{"$f":"SUMIFS('Macro Breakdown - Meal Prep'!G$5:G$152,'Macro Breakdown - Meal Prep'!$B$5:$B$152,'Order Form'!$B13,'Macro Breakdown - Meal Prep'!$C$5:$C$152,'Order Form'!$C13)","v":0},{"$f":"SUMIFS('Macro Breakdown - Meal Prep'!J$5:J$152,'Macro Breakdown - Meal Prep'!$B$5:$B$152,'Order Form'!$B13,'Macro Breakdown - Meal Prep'!$C$5:$C$152,'Order Form'!$C13)","v":0},null,"Total Price for Meal 1",{"$f":"K12*D24","v":0}]
[null,null,null,{"$f":"SUMIFS('Macro Breakdown - Meal Prep'!$K:$K,'Macro Breakdown - Meal Prep'!$B:$B,'Order Form'!$B14,'Macro Breakdown - Meal Prep'!$C:$C,'Order Form'!$C14)","v":0},{"$f":"SUMIFS('Macro Breakdown - Meal Prep'!I$5:I$152,'Macro Breakdown - Meal Prep'!$B$5:$B$152,'Order Form'!$B14,'Macro Breakdown - Meal Prep'!$C$5:$C$152,'Order Form'!$C14)","v":0},{"$f":"SUMIFS('Macro Breakdown - Meal Prep'!H$5:H$152,'Macro Breakdown - Meal Prep'!$B$5:$B$152,'Order Form'!$B14,'Macro Breakdown - Meal Prep'!$C$5:$C$152,'Order Form'!$C14)","v":0},{"$f":"SUMIFS('Macro Breakdown - Meal Prep'!G$5:G$152,'Macro Breakdown - Meal Prep'!$B$5:$B$152,'Order Form'!$B14,'Macro Breakdown - Meal Prep'!$C$5:$C$152,'Order Form'!$C14)","v":0},{"$f":"SUMIFS('Macro Breakdown - Meal Prep'!J$5:J$152,'Macro Breakdown - Meal Prep'!$B$5:$B$152,'Order Form'!$B14,'Macro Breakdown - Meal Prep'!$C$5:$C$152,'Order Form'!$C14)","v":0}]
[null,null,null,{"$f":"SUMIFS('Macro Breakdown - Meal Prep'!$K:$K,'Macro Breakdown - Meal Prep'!$B:$B,'Order Form'!$B15,'Macro Breakdown - Meal Prep'!$C:$C,'Order Form'!$C15)","v":0},{"$f":"SUMIFS('Macro Breakdown - Meal Prep'!I$5:I$152,'Macro Breakdown - Meal Prep'!$B$5:$B$152,'Order Form'!$B15,'Macro Breakdown - Meal Prep'!$C$5:$C$152,'Order Form'!$C15)","v":0},{"$f":"SUMIFS('Macro Breakdown - Meal Prep'!H$5:H$152,'Macro Breakdown - Meal Prep'!$B$5:$B$152,'Order Form'!$B15,'Macro Breakdown - Meal Prep'!$C$5:$C$152,'Order Form'!$C15)","v":0},{"$f":"SUMIFS('Macro Breakdown - Meal Prep'!G$5:G$152,'Macro Breakdown - Meal Prep'!$B$5:$B$152,'Order Form'!$B15,'Macro Breakdown - Meal Prep'!$C$5:$C$152,'Order Form'!$C15)","v":0},{"$f":"SUMIFS('Macro Breakdown - Meal Prep'!J$5:J$152,'Macro Breakdown - Meal Prep'!$B$5:$B$152,'Order Form'!$B15,'Macro Breakdown - Meal Prep'!$C$5:$C$152,'Order Form'!$C15)","v":0}]
[null,null,null,{"$f":"SUMIFS('Macro Breakdown - Meal Prep'!$K:$K,'Macro Breakdown - Meal Prep'!$B:$B,'Order Form'!$B16,'Macro Breakdown - Meal Prep'!$C:$C,'Order Form'!$C16)","v":0},{"$f":"SUMIFS('Macro Breakdown - Meal Prep'!I$5:I$152,'Macro Breakdown - Meal Prep'!$B$5:$B$152,'Order Form'!$B16,'Macro Breakdown - Meal Prep'!$C$5:$C$152,'Order Form'!$C16)","v":0},{"$f":"SUMIFS('Macro Breakdown - Meal Prep'!H$5:H$152,'Macro Breakdown - Meal Prep'!$B$5:$B$152,'Order Form'!$B16,'Macro Breakdown - Meal Prep'!$C$5:$C$152,'Order Form'!$C16)","v":0},{"$f":"SUMIFS('Macro Breakdown - Meal Prep'!G$5:G$152,'Macro Breakdown - Meal Prep'!$B$5:$B$152,'Order Form'!$B16,'Macro Breakdown - Meal Prep'!$C$5:$C$152,'Order Form'!$C16)","v":0},{"$f":"SUMIFS('Macro Breakdown - Meal Prep'!J$5:J$152,'Macro Breakdown - Meal Prep'!$B$5:$B$152,'Order Form'!$B16,'Macro Breakdown - Meal Prep'!$C$5:$C$152,'Order Form'!$C16)","v":0}]
[null,null,null,{"$f":"SUMIFS('Macro Breakdown - Meal Prep'!$K:$K,'Macro Breakdown - Meal Prep'!$B:$B,'Order Form'!$B17,'Macro Breakdown - Meal Prep'!$C:$C,'Order Form'!$C17)","v":0},{"$f":"SUMIFS('Macro Breakdown - Meal Prep'!I$5:I$152,'Macro Breakdown - Meal Prep'!$B$5:$B$152,'Order Form'!$B17,'Macro Breakdown - Meal Prep'!$C$5:$C$152,'Order Form'!$C17)","v":0},{"$f":"SUMIFS('Macro Breakdown - Meal Prep'!H$5:H$152,'Macro Breakdown - Meal Prep'!$B$5:$B$152,'Order Form'!$B17,'Macro Breakdown - Meal Prep'!$C$5:$C$152,'Order Form'!$C17)","v":0},{"$f":"SUMIFS('Macro Breakdown - Meal Prep'!G$5:G$152,'Macro Breakdown - Meal Prep'!$B$5:$B$152,'Order Form'!$B17,'Macro Breakdown - Meal Prep'!$C$5:$C$152,'Order Form'!$C17)","v":0},{"$f":"SUMIFS('Macro Breakdown - Meal Prep'!J$5:J$152,'Macro Breakdown - Meal Prep'!$B$5:$B$152,'Order Form'!$B17,'Macro Breakdown - Meal Prep'!$C$5:$C$152,'Order Form'!$C17)","v":0}]
[null,null,null,{"$f":"SUMIFS('Macro Breakdown - Meal Prep'!$K:$K,'Macro Breakdown - Meal Prep'!$B:$B,'Order Form'!$B18,'Macro Breakdown - Meal Prep'!$C:$C,'Order Form'!$C18)","v":0},{"$f":"SUMIFS('Macro Breakdown - Meal Prep'!I$5:I$152,'Macro Breakdown - Meal Prep'!$B$5:$B$152,'Order Form'!$B18,'Macro Breakdown - Meal Prep'!$C$5:$C$152,'Order Form'!$C18)","v":0},{"$f":"SUMIFS('Macro Breakdown - Meal Prep'!H$5:H$152,'Macro Breakdown - Meal Prep'!$B$5:$B$152,'Order Form'!$B18,'Macro Breakdown - Meal Prep'!$C$5:$C$152,'Order Form'!$C18)","v":0},{"$f":"SUMIFS('Macro Breakdown - Meal Prep'!G$5:G$152,'Macro Breakdown - Meal Prep'!$B$5:$B$152,'Order Form'!$B18,'Macro Breakdown - Meal Prep'!$C$5:$C$152,'Order Form'!$C18)","v":0},{"$f":"SUMIFS('Macro Breakdown - Meal Prep'!J$5:J$152,'Macro Breakdown - Meal Prep'!$B$5:$B$152,'Order Form'!$B18,'Macro Breakdown - Meal Prep'!$C$5:$C$152,'Order Form'!$C18)","v":0}]
[null,null,null,{"$f":"SUMIFS('Macro Breakdown - Meal Prep'!$K:$K,'Macro Breakdown - Meal Prep'!$B:$B,'Order Form'!$B19,'Macro Breakdown - Meal Prep'!$C:$C,'Order Form'!$C19)","v":0},{"$f":"SUMIFS('Macro Breakdown - Meal Prep'!I$5:I$152,'Macro Breakdown - Meal Prep'!$B$5:$B$152,'Order Form'!$B19,'Macro Breakdown - Meal Prep'!$C$5:$C$152,'Order Form'!$C19)","v":0},{"$f":"SUMIFS('Macro Breakdown - Meal Prep'!H$5:H$152,'Macro Breakdown - Meal Prep'!$B$5:$B$152,'Order Form'!$B19,'Macro Breakdown - Meal Prep'!$C$5:$C$152,'Order Form'!$C19)","v":0},{"$f":"SUMIFS('Macro Breakdown - Meal Prep'!G$5:G$152,'Macro Breakdown - Meal Prep'!$B$5:$B$152,'Order Form'!$B19,'Macro Breakdown - Meal Prep'!$C$5:$C$152,'Order Form'!$C19)","v":0},{"$f":"SUMIFS('Macro Breakdown - Meal Prep'!J$5:J$152,'Macro Breakdown - Meal Prep'!$B$5:$B$152,'Order Form'!$B19,'Macro Breakdown - Meal Prep'!$C$5:$C$152,'Order Form'!$C19)","v":0}]
[null,null,null,{"$f":"SUMIFS('Macro Breakdown - Meal Prep'!$K:$K,'Macro Breakdown - Meal Prep'!$B:$B,'Order Form'!$B20,'Macro Breakdown - Meal Prep'!$C:$C,'Order Form'!$C20)","v":0},{"$f":"SUMIFS('Macro Breakdown - Meal Prep'!I$5:I$152,'Macro Breakdown - Meal Prep'!$B$5:$B$152,'Order Form'!$B20,'Macro Breakdown - Meal Prep'!$C$5:$C$152,'Order Form'!$C20)","v":0},{"$f":"SUMIFS('Macro Breakdown - Meal Prep'!H$5:H$152,'Macro Breakdown - Meal Prep'!$B$5:$B$152,'Order Form'!$B20,'Macro Breakdown - Meal Prep'!$C$5:$C$152,'Order Form'!$C20)","v":0},{"$f":"SUMIFS('Macro Breakdown - Meal Prep'!G$5:G$152,'Macro Breakdown - Meal Prep'!$B$5:$B$152,'Order Form'!$B20,'Macro Breakdown - Meal Prep'!$C$5:$C$152,'Order Form'!$C20)","v":0},{"$f":"SUMIFS('Macro Breakdown - Meal Prep'!J$5:J$152,'Macro Breakdown - Meal Prep'!$B$5:$B$152,'Order Form'!$B20,'Macro Breakdown - Meal Prep'!$C$5:$C$152,'Order Form'!$C20)","v":0}]
[null,null,null,{"$f":"SUMIFS('Macro Breakdown - Meal Prep'!$K:$K,'Macro Breakdown - Meal Prep'!$B:$B,'Order Form'!$B21,'Macro Breakdown - Meal Prep'!$C:$C,'Order Form'!$C21)","v":0},{"$f":"SUMIFS('Macro Breakdown - Meal Prep'!I$5:I$152,'Macro Breakdown - Meal Prep'!$B$5:$B$152,'Order Form'!$B21,'Macro Breakdown - Meal Prep'!$C$5:$C$152,'Order Form'!$C21)","v":0},{"$f":"SUMIFS('Macro Breakdown - Meal Prep'!H$5:H$152,'Macro Breakdown - Meal Prep'!$B$5:$B$152,'Order Form'!$B21,'Macro Breakdown - Meal Prep'!$C$5:$C$152,'Order Form'!$C21)","v":0},{"$f":"SUMIFS('Macro Breakdown - Meal Prep'!G$5:G$152,'Macro Breakdown - Meal Prep'!$B$5:$B$152,'Order Form'!$B21,'Macro Breakdown - Meal Prep'!$C$5:$C$152,'Order Form'!$C21)","v":0},{"$f":"SUMIFS('Macro Breakdown - Meal Prep'!J$5:J$152,'Macro Breakdown - Meal Prep'!$B$5:$B$152,'Order Form'!$B21,'Macro Breakdown - Meal Prep'!$C$5:$C$152,'Order Form'!$C21)","v":0}]
[null,null,null,{"$f":"SUMIFS('Macro Breakdown - Meal Prep'!$K:$K,'Macro Breakdown - Meal Prep'!$B:$B,'Order Form'!$B22,'Macro Breakdown - Meal Prep'!$C:$C,'Order Form'!$C22)","v":0},{"$f":"SUMIFS('Macro Breakdown - Meal Prep'!I$5:I$152,'Macro Breakdown - Meal Prep'!$B$5:$B$152,'Order Form'!$B22,'Macro Breakdown - Meal Prep'!$C$5:$C$152,'Order Form'!$C22)","v":0},{"$f":"SUMIFS('Macro Breakdown - Meal Prep'!H$5:H$152,'Macro Breakdown - Meal Prep'!$B$5:$B$152,'Order Form'!$B22,'Macro Breakdown - Meal Prep'!$C$5:$C$152,'Order Form'!$C22)","v":0},{"$f":"SUMIFS('Macro Breakdown - Meal Prep'!G$5:G$152,'Macro Breakdown - Meal Prep'!$B$5:$B$152,'Order Form'!$B22,'Macro Breakdown - Meal Prep'!$C$5:$C$152,'Order Form'!$C22)","v":0},{"$f":"SUMIFS('Macro Breakdown - Meal Prep'!J$5:J$152,'Macro Breakdown - Meal Prep'!$B$5:$B$152,'Order Form'!$B22,'Macro Breakdown - Meal Prep'!$C$5:$C$152,'Order Form'!$C22)","v":0}]
[null,null,null,{"$f":"SUMIFS('Macro Breakdown - Meal Prep'!$K:$K,'Macro Breakdown - Meal Prep'!$B:$B,'Order Form'!$B23,'Macro Breakdown - Meal Prep'!$C:$C,'Order Form'!$C23)","v":0},{"$f":"SUMIFS('Macro Breakdown - Meal Prep'!I$5:I$152,'Macro Breakdown - Meal Prep'!$B$5:$B$152,'Order Form'!$B23,'Macro Breakdown - Meal Prep'!$C$5:$C$152,'Order Form'!$C23)","v":0},{"$f":"SUMIFS('Macro Breakdown - Meal Prep'!H$5:H$152,'Macro Breakdown - Meal Prep'!$B$5:$B$152,'Order Form'!$B23,'Macro Breakdown - Meal Prep'!$C$5:$C$152,'Order Form'!$C23)","v":0},{"$f":"SUMIFS('Macro Breakdown - Meal Prep'!G$5:G$152,'Macro Breakdown - Meal Prep'!$B$5:$B$152,'Order Form'!$B23,'Macro Breakdown - Meal Prep'!$C$5:$C$152,'Order Form'!$C23)","v":0},{"$f":"SUMIFS('Macro Breakdown - Meal Prep'!J$5:J$152,'Macro Breakdown - Meal Prep'!$B$5:$B$152,'Order Form'!$B23,'Macro Breakdown - Meal Prep'!$C$5:$C$152,'Order Form'!$C23)","v":0}]
[null,null,"Total",{"$f":"SUM($D13:$D23)","v":0},{"$f":"SUM(E13:E23)","v":0},{"$f":"SUM(F13:F23)","v":0},0,0]
[]
["MEAL 2"]
["Use Drop Down Menus to Choose Options",null,null,null,null,null,null,null,null,"Use Drop Down Menu to Choose Options"]
["Food Type","Food","Portion Size (g)","Price ($)","Protein (g)","Carbs (g)","Fat (g)","Calories",null,"Meal 2 Quantity (Min. 2)"]
[null,null,null,null,null,null,null,null,null,"Total Price for Meal 2",{"$f":"K28*D40","v":0}]
[]
[]
[]
[]
[]
[]
[]
[]
[]
[null,null,null,{"$f":"SUMIFS('Macro Breakdown - Meal Prep'!$K:$K,'Macro Breakdown - Meal Prep'!$B:$B,'Order Form'!$B39,'Macro Breakdown - Meal Prep'!$C:$C,'Order Form'!$C39)","v":0},{"$f":"SUMIFS('Macro Breakdown - Meal Prep'!I$5:I$152,'Macro Breakdown - Meal Prep'!$B$5:$B$152,'Order Form'!$B39,'Macro Breakdown - Meal Prep'!$C$5:$C$152,'Order Form'!$C39)","v":0},{"$f":"SUMIFS('Macro Breakdown - Meal Prep'!H$5:H$152,'Macro Breakdown - Meal Prep'!$B$5:$B$152,'Order Form'!$B39,'Macro Breakdown - Meal Prep'!$C$5:$C$152,'Order Form'!$C39)","v":0},{"$f":"SUMIFS('Macro Breakdown - Meal Prep'!G$5:G$152,'Macro Breakdown - Meal Prep'!$B$5:$B$152,'Order Form'!$B39,'Macro Breakdown - Meal Prep'!$C$5:$C$152,'Order Form'!$C39)","v":0},{"$f":"SUMIFS('Macro Breakdown - Meal Prep'!J$5:J$152,'Macro Breakdown - Meal Prep'!$B$5:$B$152,'Order Form'!$B39,'Macro Breakdown - Meal Prep'!$C$5:$C$152,'Order Form'!$C39)","v":0}]
[null,null,"Total",{"$f":"SUM($D29:$D39)","v":0},{"$f":"SUM(E29:E39)","v":0},{"$f":"SUM(F29:F39)","v":0},0,0]
{"$rows_left_out":49}
{"sheet":"Macro Breakdown - Meal Prep","index":1,"n_rows":154,"n_cols":11,"rows_kept":154,"cut":false,"hidden":true,"merged":[[0,1,1,2]]}
[null,"Eat Clean Express & Meal Prep\n102-795 McGill Rd\nKamloops, BC 778-471-0804"]
[]
[null,null,null,null,null,null,null,null,null,null,"EFFECTIVE 03.31.2022"]
[null,"Item","Portion","Metric UofM","Portion","Imperial UofM","Fat","Carb","Protein","Calories","Price"]
["Breakfast","Apples",100,"g",3.51,"oz",0,12.4,0,{"$f":"SUM(I5*4)+(H5*4)+(G5*9)","v":49.6},3.25]
["Breakfast","Banana",100,"g",3.5,"oz",0.3,22.8,1.1000000000000001,98.300000000000011,3.25]
["Breakfast","Breakfast Burrito",1,"ea",1,"ea",25.2,55.35,28.08,560.52,9.99]
["Breakfast","Egg Bites (cheddar, spinach, jalepeno)",1,"ea",2,"ea",19.2,4.6500000000000004,18.38,264.91999999999996,6.99]
["Breakfast","Egg Bites (feta & red pepper)",1,"ea",2,"ea",17.600000000000001,8.8000000000000007,19.53,271.72000000000003,6.99]
["Breakfast","Protein French Toast",1,"ea",2,"ea",null,null,null,null,9.99]
["Breakfast","Protein Waffle",1,"ea",1,"ea",2,30,15,198,9.99]
["Breakfast","Strawberries",100,"g",3.51,"oz",0.3,7.68,0.67,36.1,4.25]
["Carb","Brown Rice",50,"g",1.76,"oz",0.5,11.5,1.3,55.7,2]
["Carb","Brown Rice",100,"g",3.51,"oz",0.93599999999999994,23,2.6,110.82400000000001,2.75]
["Carb","Brown Rice",150,"g",5.3,"oz",1.4,34.4,3.9,165.79999999999998,3.5]
["Carb","Brown Rice",200,"g",7.05,"oz",1.8,45.9,5.2,220.6,4.25]
["Carb","Butternut Squash  ",50,"g",1.8,"oz",0,5.2,0.5,22.8,2.75]
["Carb","Butternut Squash  ",100,"g",3.51,"oz",0,10.4,0.93599999999999994,45.344000000000001,3.75]
["Carb","Butternut Squash  ",150,"g",5.3,"oz",0.1,15.7,1.4,69.3,4.75]
["Carb","Butternut Squash  ",200,"g",7.05,"oz",0.2,20.9,1.8,92.6,5.75]
["Carb","Gluten Free Penne Pasta",50,"g",1.8,"oz",{"$f":"G22/2","v":0.87749999999999995},{"$f":"H22/2","v":38.61},{"$f":"I22/2","v":2.9249999999999998},174.03749999999999,2.5]
["Carb","Gluten Free Penne Pasta",100,"g",3.51,"oz",1.7549999999999999,77.22,5.85,348.07499999999999,3.5]
["Carb","Gluten Free Penne Pasta",150,"g",5.3,"oz",{"$f":"SUM(G21:G22)","v":2.6324999999999998},{"$f":"SUM(H21:H22)","v":115.83},{"$f":"SUM(I21:I22)","v":8.7749999999999986},522.11249999999995,4.75]
["Carb","Gluten Free Penne Pasta",200,"g",7.05,"oz",3.5249999999999999,155.1,11.75,699.125,5.75]
["Carb","Quinoa",50,"g",1.8,"oz",1,10.7,2.2000000000000002,60.599999999999994,2.5]
["Carb","Quinoa",100,"g",3.51,"oz",1.9,21.3,4.4000000000000004,119.9,3.5]
["Carb","Quinoa",150,"g",5.3,"oz",{"$f":"SUM(G25:G26)","v":2.9},{"$f":"SUM(H25:H26)","v":32},{"$f":"SUM(I25:I26)","v":6.6000000000000005},180.5,4.75]
["Carb","Quinoa",200,"g",7.05,"oz",3.8,42.6,8.8000000000000007,239.8,5.75]
["Carb","Sweet Potato",50,"g",1.8,"oz",0.01,10.4,1,45.690000000000005,2.75]
["Carb","Sweet Potato",100,"g",3.51,"oz",0.2,20.7,1.9889999999999999,92.555999999999997,3.75]
["Carb","Sweet Potato",150,"g",5.3,"oz",0.2,31.1,3,138.20000000000002,4.75]
["Carb","Sweet Potato",200,"g",7.05,"oz",0.3,41.4,3.9949999999999997,184.27999999999997,5.75]
["Carb","White Rice",50,"g",1.8,"oz",0.1,14.1,1.3,62.5,2]
["Carb","White Rice",100,"g",3.51,"oz",0.3,28.2,2.7,126.3,2.75]
["Carb","White Rice",150,"g",5.3,"oz",0.4,42.3,4,188.79999999999998,3.5]
["Carb","White Rice",200,"g",7.05,"oz",0.6,56.3,5.4,252.2,4.25]
["Carb","Zucchini  ",50,"g",1.8,"oz",0.2,1.3,0.6,9.4,2.75]
["Carb","Zucchini  ",100,"g",3.51,"oz",0.4,2.7,1.0529999999999999,{"$f":"SUM(I38*4)+(H38*4)+(G38*9)","v":18.612000000000002},3.75]
["Carb","Zucchini  ",150,"g",5.3,"oz",0.5,4,1.7,27.3,4.75]
["Carb","Zucchini  ",200,"g",7.05,"oz",0.7,5.4,2.2999999999999998,37.1,5.75]
{"$rows_left_out":115}
{"sheet":"Options List","index":2,"n_rows":23,"n_cols":10,"rows_kept":23,"cut":false,"hidden":true,"merged":[]}
["Breakfast","Carb","Cheese","Protein","Veggie","Sauce","Spice","Grams","Food Type","Quantity"]
[]
["Apples","Brown Rice","Cheddar","Beyond Meat","Asparagus","Balsamic & Olive Oil","Buffalo",1,"Breakfast",2]
["Banana","Butternut Squash  ","Daiya Mozzarella","Black Beans","Avocado","Balsamic Dressing","Cajun Lovers",15,"Carb",3]
["Breakfast Burrito","Gluten Free Penne Pasta","Feta","Chicken Breast","Broccoli","Basil Pesto","Chipotle",30,"Cheese",4]
["Egg Bites (cheddar, spinach, jalepeno)","Quinoa",null,"Ground Beef (Lean, Halal)","Carrots","Chipotle Mayo","Everything ",50,"Protein",5]
["Egg Bites (feta & red pepper)","Sweet Potato",null,"Ground Bison","Cauliflower","Extra Virgin Olive Oil","Garlic & Herb Salt",60,"Sauce",6]
["Protein French Toast","White Rice",null,"Ground Turkey","Green Beans","Ketchup, No Sugar Added","Garlic Lovers",100,"Spice",7]
["Protein Waffle","Zucchini  ",null,"Salmon","Peppers, Red","Marinara","Honey BBQ",150,"Veggie",8]
["Strawberries",null,null,"Shrimp","Side Strawberry Spinach Salad no dressing","Mustard","Italian Zest",200,null,9]
[null,null,null,"Sirloin","Side Strawberry Spinach Salad w Raspberry Vinaigrette","Raspberry Vinaigrette, Fat Free","Lemon & Garlic",null,null,10]
[null,null,null,"Tofu",null,"Salsa","Ranch ",null,null,11]
[null,null,null,null,null,"Sour Cream","Sriracha",null,null,12]
[null,null,null,null,null,"Sriracha","Steak & Chop Rub",null,null,13]
[null,null,null,null,null,"Sweet Chili Thai","Taco Tuesday",null,null,14]
[null,null,null,null,null,"Syrup, Walden's Zero Calorie, Blueberry",null,null,null,15]
[null,null,null,null,null,"Syrup, Walden's Zero Calorie, Caramel",null,null,null,16]
[null,null,null,null,null,"Syrup, Walden's Zero Calorie, Chocolate",null,null,null,17]
[null,null,null,null,null,"Syrup, Walden's Zero Calorie, Maple",null,null,null,18]
[null,null,null,null,null,"Syrup, Walden's Zero Calorie, Strawberry",null,null,null,19]
[null,null,null,null,null,"Teriyaki",null,null,null,20]
[null,null,null,null,null,"Tomato Basil Pesto"]
[null,null,null,null,null,"Tzatziki"]